{"text_format":"1","workbook":"xlsx","n_sheets":3,"sheets":["Transferencia Exterior","Control de Cambios","Lista"],"not_rendered":{"charts":0,"images":2,"macros":1,"external_links":0,"defined_names":2,"comments":0,"pivot_tables":0},"unopened":[],"bounds":{"document_bytes":16777216,"sheet_cells":100000,"rows_first":2000,"rows_last":500,"rows_between":2000,"halvings":0,"cell_chars":16384,"cell_head_chars":4096},"cells_cut":0,"cells_raw":0,"read":"whole","date_system":"1900"}

{"sheet":"Transferencia Exterior","index":0,"n_rows":224,"n_cols":48,"rows_kept":224,"cut":false,"hidden":false,"merged":[[1,42,1,80],[2,1,2,40],[5,1,5,40],[7,8,7,39],[13,8,13,16],[23,8,23,13],[27,8,27,39],[29,1,29,40],[9,8,9,22],[1,33,1,40],[13,20,13,26],[19,1,19,40],[17,8,17,22],[3,33,3,34],[21,18,21,39],[25,8,25,13],[13,29,13,39],[25,18,25,28],[3,29,3,31],[15,1,15,40],[3,35,3,38],[11,8,11,39],[103,47,103,60],[79,4,79,18],[74,1,74,40],[39,10,39,22],[41,23,41,26],[33,8,33,39],[104,47,104,60],[94,43,94,79],[90,45,91,46],[89,45,89,46],[89,47,89,57],[86,43,86,79],[2,43,83,79],[103,67,103,78],[104,67,104,78],[90,47,91,57],[79,25,79,38],[49,10,49,39],[53,7,53,20],[57,7,57,20],[48,10,48,39],[31,1,31,40],[55,12,55,31],[78,5,78,18],[149,3,149,4],[148,3,148,4],[126,15,126,18],[101,8,101,13],[96,1,96,40],[81,1,81,20],[47,26,47,39],[45,10,45,39],[35,8,35,22],[43,1,43,40],[47,10,47,24],[59,1,59,40],[90,22,90,28],[140,11,140,16],[140,2,140,6],[81,21,81,40],[90,12,90,19],[144,2,144,6],[53,27,53,39],[37,10,37,39],[78,25,78,38],[39,27,39,39],[41,27,41,39],[73,1,73,40],[57,22,57,39],[71,1,71,40],[61,2,61,38],[63,7,63,14],[63,23,63,27],[63,33,63,38],[67,1,67,40],[69,2,69,38],[98,1,98,40],[65,7,65,14],[65,23,65,27],[65,33,65,38],[125,14,125,18],[82,21,82,29],[147,3,147,4],[113,11,113,16],[114,11,114,16],[126,19,126,21],[82,1,82,10],[145,11,145,12],[115,11,115,16],[90,2,90,8],[82,11,82,20],[125,19,125,21],[146,3,146,4],[143,2,143,6],[142,11,142,16],[142,20,142,22],[92,2,92,19],[141,2,141,6],[142,2,142,6],[97,1,97,40],[90,31,90,39],[82,30,82,40],[130,3,130,7]]}
[]
[null,null,null,null,null,null,null,null,null,null,null,null,null,null,null,null,null,null,null,null,null,null,null,null,null,null,null,null,null,null,null,"Serial:",null,{"$f":"+NOW()","v":"2022-11-25T09:12:42.810"},null,null,null,null,null,null,null,null,"TÉRMINOS Y CONDICIONES PARA ENVÍO DE TRANSFERENCIAS"]
[null,"SOLICITUD DE TRANSFERENCIA AL EXTERIOR",null,null,null,null,null,null,null,null,null,null,null,null,null,null,null,null,null,null,null,null,null,null,null,null,null,null,null,null,null,null,null,null,null,null,null,null,null,null,null,null,null,"1.- El Cliente declara expresamente y con la gravedad del juramento, que los fondos a ser enviados, por él, sus dependientes o terceros, debidamente autorizados por él, tienen origen y destino lícitos, sin relación alguna con las infracciones previstas en la Ley De Substancias Estupefacientes y Psicotrópicas y la Ley de Prevención, Detección y Erradicación del Delito de Lavado de Activos y Financiamiento de Delitos y, se compromete a proporcionar los justificativos necesarios en caso de que el Banco del Austro los requiera; declara que no está vinculado, ni directa ni indirectamente con ninguna actividad relacionada con la producción, consumo o tráfico, ni con la utilización de dinero procedente de estas actividades. Si esta declaración fuese falsa o errónea, el Cliente será responsable de tal falsedad o error, sin que el Banco del Austro S.A. tenga responsabilidad alguna en tales actos, quedando por tanto liberado frente a cualquier autoridad o persona. El Banco está expresamente facultado para confirmar la información consignada por el Cliente en la presente solicitud, así como, para proporcionar a las autoridades competentes las informaciones que éstas demanden, en los casos previstos en la Ley y Reglamentos.\n\n\n2.- El Banco, sus funcionarios y empleados, no serán responsables frente al CLIENTE ni frente a terceros, si por razones de caso fortuito o fuerza mayor, se vieran imposibilitados de realizar la orden de transferencia solicitada. Se deja constancia además que ni el Banco, ni sus funcionarios o empleados serán responsables por perjuicios, en caso de que el CLIENTE, por si mismo o por personas autorizados por el CLIENTE, proporcionen información o instrucciones incompletas, confusas, erróneas o atrasadas, para cuya constancia se presentará la orden de transferencia recibida.\n\n\n3.- El Banco no efectuará modificaciones, sustituciones o correcciones, si la información tiene alguna inconsistencia. El Banco, NO será responsable en caso de que -por cualquier motivo- y en especial a errores de la información, la transferencia de fondos no pueda realizarse. En consecuencia el CLIENTE exime al BANCO de toda responsabilidad aún ante terceros, si la información que el Banco dispone es falsa o errónea. Igualmente el Banco NO será responsable de interrupciones, omisiones, errores o demoras que ocurran, por cualquier causa que esté fuera del control del Banco. \n\n\n4.- El cliente declara que ha sido informado y acepta las condiciones y tarifas por servicios que deberá cancelar al Banco. Todos los tributos, costos y gastos derivados de la suscripción y ejecución de la presente solicitud, correrán por cuenta del cliente. El cliente acepta y conoce el costo directo o indirecto que cargue la Institución Financiera Local a él/los beneficiarios y que cualquier reclamo en ese sentido deberá ser realizado por él/los beneficiarios a la correspondiente Institución Financiera Local.  Por medio del presente documento el CLIENTE autoriza irrevocablemente al Banco del Austro S.A., a debitar de la cuenta señalada en el anverso de esta solicitud, el valor del giro mas los costos según tarifario vigente, comisiones e impuestos respectivos con el objeto de realizar la transacción solicitada.\n\n\n5.- El Cliente declara que acepta y conoce que en caso de, que el Banco ejecute una orden de transferencia de fondos a favor de un/unos beneficiarios y que la misma se acredite en la cuenta especificada por el cliente; dicha transferencia no puede dejarse sin efecto ni los fondos pueden ser devueltos sin que exista la expresa autorización del/los Beneficiarios; el Banco a pedido del Cliente - se compromete a gestionar la solicitud de devolución pero en ningún momento eso significa obligación de reembolso mientras los fondos no hayan sido puestos a disposición del Banco por la Institución Financiera Local. En caso de solicitar que el Banco gestione la devolución de los fondos originados en una orden de transferencia, el Cliente asume desde ya los costos y demás gastos que dicha gestión demande."]
[null,null,null,null,null,null,null,null,null,null,null,null,null,null,null,null,null,null,null,null,null,null,null,null,null,null,null,"FECHA:   ",null,{"$f":"+NOW()","v":"2022-11-25T09:12:42.810"},null,null,null,"Hora",null,{"$f":"+NOW()","v":44890.383828819446}]
[]
[null,"1.- DATOS DEL ORDENANTE:  (obligatoriamente debe ser el titular de la cuenta a debitar)"]
[]
[null,"1.1.- Nombre y Apellido:"]
[]
[null,"1.2.- C.I. / RUC:"]
[]
[null,"1.3.- Dirección:"]
[]
[null,"1.4.- Ciudad-País:",null,null,null,null,null,null,null,null,null,null,null,null,null,null,null,null,"1.5.- Teléfono",null,null,null,null,null,null,null,null,"        1.6.- E-mail"]
[]
[null,"2.- CUENTA A DEBITAR"]
[]
[null,"2.1.- Con cargo a N° Cuenta: ",null,null,null,null,null,null,null,null,null,null,null,null,null,null,null,null,null,null,null,null,null,null,"Corriente ",null,null,null,null,"Ahorros "]
[]
[null,"3.-VALOR DE LA TRANSFERENCIA                                                                           "]
[]
[null,null,null,null,null,null,null,null,null,null,null,null,null,null,null,null,null,null,"EXCEPCIÓN DEL IMPUESTO DE SALIDA DE DIVISAS"]
[]
[null,"3.1.- Tipo de Moneda",null,null,null,null,{"$f":"+IF(AND(I26>0),\"\",IF(OR($I$24=$D$103,$I$24=$D$104,$I$24=$D$105),$D$107,\"\"))","v":""},null,"Dólar",null,null,null,null,null,null,null,null,null,"Excepción Total Autorización SRI"]
[]
[null,"3.2.- Valor en Números:",null,null,null,null,null,null,null,null,null,null,null,null,null,null,null,null,"Excepción Total Aerolíneas"]
[]
[null,"3.3.- Valor en Letras:",null,null,null,null,null,null,{"$f":"NumLetras(I26,I24,I102)","v":" 00/100 Dólares"}]
[]
[null,"PARA USO EXCLUSIVO DEL BANCO"]
[]
[null,"4.- DATOS DEL BENEFICIARIO"]
[]
[null,"4.1.- Nombres y Apellidos: "]
[]
[null,"4.2.-  CTA BNF/IBAN/CLAVE"]
[]
[null,"4.3.- Dirección del Beneficiario:"]
[]
[null,"4.4.- Ciudad Domicilio del Beneficiario:",null,null,null,null,null,null,null,null,null,null,null,null,null,null,null,null,null,null,null,null,null,"4.5.- País de destino:",null,null,null,""]
[]
[null,null,null,null,null,null,null,null,null,null,null,null,null,null,null,null,null,null,null,null,null,null,null,"4.6.- Acción:",null,null,null,{"$f":"IFERROR((IF(AB40=\"\",\"SELECCIONE UN PAIS\",VLOOKUP($AB$40,Lista!B1:C262,2,0))),\"VERIFIQUE NOMBRE DEL PAIS\")","v":"SELECCIONE UN PAIS"}]
[]
[null,"5.- BANCO BENEFICIARIO"]
[]
[null,"5.1.- Nombre del Banco Beneficiario:"]
[]
[null,"5.2.- SWIFT/ABA "]
[null,null,null,null,null,null,{"$f":"+IF(K48=\"\",\"\",IF(D131=TRUE,\"\",\"Pulse Aquí\"))","v":""},null,{"$f":"+IF(K48=\"\",\"\",IF(D131=TRUE,\"\",\"↑\"))","v":""},null,{"$f":"+IF(K48=\"\",\"\",IF(D131=TRUE,\"Código Confirmado con el Cliente\",\"Confirmar Código Swift con el Cliente\"))","v":""}]
[null,"5.3.- País del Banco Beneficiario:"]
[]
[null,"6.- BANCO INTERMEDIARIO "]
[]
[null,"6.1.- Nombre del Banco"]
[]
[null,"6.2.- N° de Cuenta en el Banco Intermediario: "]
[]
[null,"6.3.- SWIFT/ABA"]
[]
[null,"7.- MOTIVO ECONÓMICO"]
[]
[null,null,"110.- ANTICIPO POR IMPORTACIONES"]
[]
[null,"7.1.- No. Contrato reaseguro",null,null,null,null,null,null,null,null,null,null,null,null,null,"7.2.- No. Registro de pago BCE",null,null,null,null,null,null,null,null,null,null,null,null,"7.3.- Fecha de pago BCE"]
[]
[null,"7.4.- No. DAE",null,null,null,null,null,null,null,null,null,null,null,null,null,"7.5.- No. DAI",null,null,null,null,null,null,null,null,null,null,null,null,"7.6.- No. DAS"]
[]
[null,"8.- DETALLES ADICIONALES"]
[]
[]
[]
[null,"AUTORIZACIÓN"]
[null,"Autorizo a debitar de mi cuenta el valor de la transferencia, incluyendo las comisiones e impuestos respectivos."]
[]
[null,"CLIENTE ORDENANTE"]
[]
[]
[null,null,"Firma Ordenante",null,null,null,null,null,null,null,null,null,null,null,null,null,null,null,null,null,null,null,"Firma Ordenante"]
[null,null,"Nombre:",null,null,null,null,null,null,null,null,null,null,null,null,null,null,null,null,null,null,null,"Nombre:"]
[null,null,"C.C: ",null,null,null,null,null,null,null,null,null,null,null,null,null,null,null,null,null,null,null,"C.C: "]
[]
[null,"SUCURSAL / AGENCIA",null,null,null,null,null,null,null,null,null,null,null,null,null,null,null,null,null,null,null,"OPERACIONES"]
[null,"Recibido / Elaborado por:",null,null,null,null,null,null,null,null,null,"Verificado por:",null,null,null,null,null,null,null,null,null,"Procesado por:",null,null,null,null,null,null,null,null,"Autorizado por:"]
[null,"Firma Responsable",null,null,null,null,null,null,null,null,null,null,"Firma Responsable",null,null,null,null,null,null,null,null,null,"Firma Responsable",null,null,null,null,null,null,null,null,"Firma Responsable"]
[]
[]
[null,null,null,null,null,null,null,null,null,null,null,null,null,null,null,null,null,null,null,null,null,null,null,null,null,null,null,null,null,null,null,null,null,null,null,null,null,null,null,null,null,null,null,"GLOSARIO DE TÉRMINOS"]
[null,"Nombre Responsable",null,null,null,null,null,null,null,null,null,null,"Nombre Responsable",null,null,null,null,null,null,null,null,null,"Nombre Responsable",null,null,null,null,null,null,null,null,"Nombre Responsable"]
[null,null,null,null,null,null,null,null,null,null,null,null,null,null,null,null,null,null,null,null,null,null,null,null,null,null,null,null,null,null,null,null,null,null,null,null,null,null,null,null,null,null,null,null,null,"DAE",null,"Documento Aduanero de Exportación"]
[null,null,null,null,null,null,null,null,null,null,null,null,null,null,null,null,null,null,null,null,null,null,null,null,null,null,null,null,null,null,null,null,null,null,null,null,null,null,null,null,null,null,null,null,null,"DAI",null,"Documento Aduanero de Importación"]
[null,null,null,null,null,null,null,null,null,null,null,null,null,null,null,null,null,null,null,null,null,null,null,null,null,null,null,null,null,null,null,null,null,null,null,null,null,null,null,null,null,null,null,null,null,"DAS",null,"Documento Aduanero Simplificado"]
[]
[null,null,"Verificado Firmas, Fondos y Listas Restringidas / Control"]
[]
[]
[]
[null,"ES RESPONSABILIDAD DEL CLIENTE VERIFICAR LOS DATOS DE ESTE FORMULARIO"]
[null,"EL CLIENTE ACEPTA LAS CONDICIONES DETALLADAS EN EL REVERSO DE ESTA SOLICITUD"]
[null,"EL CLIENTE DEBE FIRMAR AL REVERSO DE ESTA SOLICITUD"]
[]
[null,null,"TIPO DE CAMBIO",null,null,null,null,null,"Plural"]
[null,null,null,"Dólar",null,null,null,null,{"$f":"+IF(I24=\"Dólar\",\"Dólares\",IF(I24=\"Yen\",\"Yenes\",IF(I24=\"Euro\",\"Euros\",IF(I24=\"Libra Esterlina\",\"Libras Esterlinas\",\"\"))))","v":"Dólares"}]
[null,null,null,"Euro"]
[]
[]
[]
[null,null,null,"Importante: Ingrese el Tipo de Cambio"]
[]
[]
[]
[]
[null,null,"CUENTAS BANCOS EXTERIOR"]
[]
[null,null,null,"CITIBANK",null,null,null,null,null,null,null,11031513]
[null,null,null,"COMMERZBANK",null,null,null,null,null,null,null,11031515]
[null,null,null,"BILBAO VIZCAYA",null,null,null,null,null,null,null,11031510]
[]
[]
[]
[]
[]
[null,null,"Mensaje"]
[null,null,"SU TRANSFERENCIA SERÁ PROCESADA EN UN LAPSO DE 24 HORAS"]
[null,null,"SU TRANSFERENCIA SERÁ PROCESADA EN UN LAPSO DE 48 HORAS"]
[]
[null,null,null,null,null,"Entero",null,{"$f":"+(O126-INT(O126))*24","v":9.2118916666950099},null,null,null,null,"Hora",null,{"$f":"+NOW()","v":44890.383828819446}]
[null,null,null,null,null,"Entero",null,{"$f":"+(P127-INT(P127))*24","v":13.000559999956749},null,null,null,null,"Verificador",null,null,42547.541689999998]
[]
[]
[null,null,"Confirmar Swift"]
[null,null,null,false]
[]
[]
[]
[]
[null,null,null,null,null,null,null,null,null,null,null,0]
[]
[]
[null,null,"Valores a debitar",null,null,null,null,null,null,null,null,0]
[null,null,null,null,null,null,null,null,null,null,null,1]
[null,null,{"$f":"+IF(L142=1,TRUE,FALSE)","v":false},null,null,null,null,"Parcial",null,null,null,0]
[null,null,false,null,null,null,null,"Total",null,null,null,0,null,null,null,null,null,null,null,null,"% ISD"]
[null,null,{"$f":"+#REF!-#REF!","v":{"$error":"#REF!"}},null,null,null,null,"Valor Exento",null,null,null,{"$f":"#REF!*U143","v":{"$error":"#REF!"}},null,null,null,null,null,null,null,null,4.7500000000000001E-2]
[null,null,false,null,null,null,null,"SRI"]
[null,null,false,null,null,null,null,"Aerolineas"]
[null,null,"Comisiones",null,null,null,null,null,null,null,null,49.54,null,null,{"$f":"+L146*0.12","v":5.9447999999999999},null,null,{"$f":"+L146+O146","v":55.4848}]
[null,null,null,{"$f":"+R146","v":55.4848},null,null,null,null,null,null,null,null,66.36,null,{"$f":"+M147*0.12","v":7.9631999999999996},null,null,{"$f":"+M147+O147","v":74.3232}]
[null,null,null,{"$f":"+R147","v":74.3232},null,null,null,null,null,null,null,null,85.18,null,{"$f":"+M148*0.12","v":10.2216},null,null,{"$f":"+M148+O148","v":95.401600000000002}]
[null,null,null,{"$f":"+R148","v":95.401600000000002},null,null,null,null,null,null,null,null,100,null,{"$f":"+M149*0.12","v":12},null,null,{"$f":"+M149+O149","v":112}]
[null,null,null,{"$f":"+R149","v":112}]
[]
[]
[]
[]
[]
[]
[]
[]
[]
[]
[]
[]
[]
[]
[]
[]
[]
[]
[null,null,null,"          PAGOS VARIOS"]
[null,null,null,"105.- IMPORTACIONES"]
[null,null,null,"106.- EXPORTACIONES "]
[null,null,null,"110.- ANTICIPO POR IMPORTACIONES"]
[null,null,null,"111.- ANTICIPO POR EXPORTACIONES "]
[null,null,null,"201.- SERVICIOS DE TRANSPORTE MARITIMO, AEREO Y TERRESTRE"]
[null,null,null,"202.- SERVICIOS DE TRANSPORTE MARITIMO, AEREO Y TERRESTRE"]
[null,null,null,"203.- SERVICIOS PORTUARIOS Y DE AEROPUERTO "]
[null,null,null,"205.- VIAJES, SALVO SEVICIOS DE TRANSPORTE DE PASAJERO "]
[null,null,null,"210.- PRIMAS DE SEGUROS / RETROCESIONES "]
[null,null,null,"212.- INDEMIZACIONES DE SEGUROS "]
[null,null,null,"214.- SERVICIOS FINANCIEROS "]
[null,null,null,"216.- RESTITUCION DE AVALES Y GARANTIAS EN MONEDA EXTRANJERA "]
[null,null,null,"218.- ARRENDAMIENTO MERCANTIL "]
[null,null,null,"220.- SERVICIOS DE TELECOMUNICACIONES "]
[null,null,null,"222.- SERVICIOS DE INFORMATICA Y DE INFORMACION "]
[null,null,null,"224.- MARCAS Y PATENTES"]
[null,null,null,"225.- REGALIAS, DERECHOS DE LICENCIA Y DE AUTOR"]
[null,null,null,"226.- SERVICIOS DE ARQUITECTONICOS, DE INGENIERIA Y OTROS SERVICIOS "]
[null,null,null,"228.- SERVICIOS AGRICOLAS, MINEROS Y DE TRANSFORMACION "]
[null,null,null,"230.- SERVICIOS MEDICOS, QUIRURGICOS Y HOSPITALARIOS "]
[null,null,null,"232.- SERVICIOS AUDIVISUALES Y AFINES "]
[null,null,null,"240.- ARRENDAMIENTO  "]
[null,null,null,"242.- CONSTRUCCION "]
[null,null,null,"244.- INVESTIGACION Y DESARROLLO "]
[null,null,null,"246.- SERVICIOS JURIDICOS, CONTABLES Y DE ASESORAMIENTO"]
[null,null,null,"248.- SERVCIOS DE PUBLICIDAD E INVESTIGACION DE MERCADERIAS"]
[null,null,null,"250.- REPARACIONES "]
[null,null,null,"251.- SERVICIOS DE PROCESAMIENTO DE BASURAS Y CONTAMINANTES"]
[null,null,null,"252.- SERVICIOS DE COMPRAVENTA DE SERVICIOS RELACIONADOS CON EL COMERCIO"]
[null,null,null,"260.- SERVICIOS CULTURALES, ARTISTICOS Y DEPORTIVOS "]
[null,null,null,"262.- SERVICIOS A GOBIERNOS EXTRANJEROS "]
{"$rows_left_out":25}
{"sheet":"Control de Cambios","index":1,"n_rows":8,"n_cols":5,"rows_kept":8,"cut":false,"hidden":true,"merged":[[3,0,3,4]]}
[]
[]
[]
["REGISTROS DE CAMBIOS EN EL DOCUMENTO"]
["Versión","Descripción del cambio","Realizado por","Aprobado por","Fecha"]
["1.0","·    Documento original.","Organización y Procesos","Jefe de Comercio Exterior","2022-02-24"]
["2.0"," -Eliminación de la Tabla Total a Debitar.\n-Eliminación del campo Valor parcial ISD y Valor Total ISD\nEliminación del campo Tipo de Cambio","Organización y Procesos","Jefe de Comercio Exterior","2022-06-01"]
[3,"Actualización de Países a los cuales se debe realizar Debida Diligencia Ampliada","Organización y Procesos","Gerente Nacional de Cumplimiento / Gerente Nacional de Operaciones / Jefe de Comercio Exterior / Oficial de Cumplimiento","2022-11-16"]

{"sheet":"Lista","index":2,"n_rows":262,"n_cols":3,"rows_kept":262,"cut":false,"hidden":true,"merged":[]}
["CPAIS","PAIS","DESCRIPCION"]
["AF","AFGANISTAN","PROCEDE"]
["AX","ALAND","PROCEDE"]
["AL","ALBANIA","DEBIDA DILIGENCIA AMPLIADA"]
["DE","ALEMANIA","PROCEDE"]
["AD","ANDORRA","DEBIDA DILIGENCIA AMPLIADA"]
["AO","ANGOLA","DEBIDA DILIGENCIA AMPLIADA"]
["AI","ANGUILA","DEBIDA DILIGENCIA AMPLIADA"]
["AQ","ANTARTIDA","PROCEDE"]
["AG","ANTIGUA Y BARBUDA","DEBIDA DILIGENCIA AMPLIADA"]
["AN","ANTILLAS HOLANDESAS","PROCEDE"]
["SA","ARABIA SAUDITA","PROCEDE"]
["DZ","ARGELIA","PROCEDE"]
["AR","ARGENTINA","PROCEDE"]
["AM","ARMENIA","PROCEDE"]
["AW","ARUBA","DEBIDA DILIGENCIA AMPLIADA"]
["AU","AUSTRALIA","PROCEDE"]
["AT","AUSTRIA","PROCEDE"]
["AZ","AZERBAIYAN","PROCEDE"]
["BS","BAHAMAS","DEBIDA DILIGENCIA AMPLIADA"]
["BH","BAHREIN","DEBIDA DILIGENCIA AMPLIADA"]
["BD","BANGLADESH","PROCEDE"]
["BB","BARBADOS","DEBIDA DILIGENCIA AMPLIADA"]
["BY","BELARUS","PROCEDE"]
["BE","BELGICA","PROCEDE"]
["BZ","BELICE","DEBIDA DILIGENCIA AMPLIADA"]
["BJ","BENIN","PROCEDE"]
["BM","BERMUDAS","DEBIDA DILIGENCIA AMPLIADA"]
["BO","BOLIVIA","PROCEDE"]
["BQ","BONAIRE, SABA Y SAN EUSTAQUIO  ","DEBIDA DILIGENCIA AMPLIADA"]
["BA","BOSNIA-HERCEGOVINA","PROCEDE"]
["BW","BOTSUANA","PROCEDE"]
["BR","BRASIL","PROCEDE"]
["BN","BRUNEI DARUSSALAN","DEBIDA DILIGENCIA AMPLIADA"]
["BG","BULGARIA","PROCEDE"]
["BF","BURKINA FASO","DEBIDA DILIGENCIA AMPLIADA"]
["BI","BURUNDI","PROCEDE"]
["BT","BUTAN","PROCEDE"]
["CV","CABO VERDE","DEBIDA DILIGENCIA AMPLIADA"]
["KH","CAMBOYA","DEBIDA DILIGENCIA AMPLIADA"]
["CM","CAMERUN","PROCEDE"]
[null,"CAMPIONE D’ITALIA","DEBIDA DILIGENCIA AMPLIADA"]
["CA","CANADA","PROCEDE"]
["TD","CHAD","PROCEDE"]
["CL","CHILE","PROCEDE"]
["CN","CHINA","PROCEDE"]
["CY","CHIPRE","PROCEDE"]
["VA","CIUDAD DEL VATICANO","PROCEDE"]
["CO","COLOMBIA","PROCEDE"]
["KM","COMORAS","PROCEDE"]
["CG","CONGO","DEBIDA DILIGENCIA AMPLIADA"]
["CD","COREA DEL NORTE","NO PROCESAR TRANSACCIÓN"]
["KP","COREA DEL SUR","PROCEDE"]
["KR","COSTA DE MARFIL","PROCEDE"]
["CI","COSTA RICA","PROCEDE"]
["CR","CROACIA","PROCEDE"]
["HR","CUBA","NO PROCESAR TRANSACCIÓN"]
["CW","CURAZAO","DEBIDA DILIGENCIA AMPLIADA"]
["CU","DINAMARCA","PROCEDE"]
["DK","DOMINICA","DEBIDA DILIGENCIA AMPLIADA"]
["DM","ECUADOR","PROCEDE"]
["EC","EGIPTO","PROCEDE"]
["EG","EL SALVADOR","PROCEDE"]
["SV","EMIRATOS ARABES UNIDOS","DEBIDA DILIGENCIA AMPLIADA"]
["AE","ERITREA","PROCEDE"]
["ER","ESLOVAQUIA","PROCEDE"]
["SK","ESLOVENIA","PROCEDE"]
["SI","ESPAÑA","PROCEDE"]
["ES","ESTADOS UNIDOS","PROCEDE"]
["US","ESTONIA","PROCEDE"]
["EE","ETIOPIA","PROCEDE"]
["ET","FILIPINAS","DEBIDA DILIGENCIA AMPLIADA"]
["PH","FINLADIA","PROCEDE"]
["FI","FIYI","PROCEDE"]
["FJ","FRANCIA","PROCEDE"]
["FR","GABON","PROCEDE"]
["GA","GAMBIA","PROCEDE"]
["GM","GEORGIA","PROCEDE"]
["GE","GHANA","PROCEDE"]
["GH","GIBRALTAR","DEBIDA DILIGENCIA AMPLIADA"]
["GI","GRANADA","DEBIDA DILIGENCIA AMPLIADA"]
["GD","GRECIA","PROCEDE"]
["GR","GROENLANDIA","DEBIDA DILIGENCIA AMPLIADA"]
["GL","GUADALUPE","PROCEDE"]
["GP","GUAM","DEBIDA DILIGENCIA AMPLIADA"]
["GU","GUATEMALA","PROCEDE"]
["GT","GUAYANA FRANCESA","PROCEDE"]
["GF","GUERNSEY","PROCEDE"]
["GG","GUINEA","PROCEDE"]
["GN","GUINEA BISSAU","PROCEDE"]
["GW","GUINEA ECUATORIAL","PROCEDE"]
["GQ","GUYANA","DEBIDA DILIGENCIA AMPLIADA"]
["GY","HAITI","DEBIDA DILIGENCIA AMPLIADA"]
["HT","HONDURAS","PROCEDE"]
["HN","HONG KONG","DEBIDA DILIGENCIA AMPLIADA"]
["HK","HUNGRIA","PROCEDE"]
["HU","INDIA","PROCEDE"]
["IN","INDONESIA","PROCEDE"]
["ID","IRÁN","NO PROCESAR TRANSACCIÓN"]
["IR","IRAQ","PROCEDE"]
["IQ","IRLANDA","PROCEDE"]
["IE","ISLA BOUVET","PROCEDE"]
[null,"ISLA DE ASCENSION","DEBIDA DILIGENCIA AMPLIADA"]
["BV","ISLA DE MAN","PROCEDE"]
["NG","ISLA DE NORFOLK","DEBIDA DILIGENCIA AMPLIADA"]
["SM","ISLA DE SAN PEDRO Y MIGUELON","DEBIDA DILIGENCIA AMPLIADA"]
[null,"ISLA QESHM","DEBIDA DILIGENCIA AMPLIADA"]
["CX","ISLANDIA","PROCEDE"]
[null,"ISLAS AZORES","DEBIDA DILIGENCIA AMPLIADA"]
["IS","ISLAS CAIMAN","DEBIDA DILIGENCIA AMPLIADA"]
["IM","ISLAS CHRISTMAS","DEBIDA DILIGENCIA AMPLIADA"]
["VC","ISLAS COCOS O KEELING","DEBIDA DILIGENCIA AMPLIADA"]
["KY","ISLAS COOK","DEBIDA DILIGENCIA AMPLIADA"]
["CC","ISLAS FEROE","PROCEDE"]
["CK","ISLAS GEORGIAS SUR Y SANDWICH","PROCEDE"]
["FO","ISLAS HEARD Y MCDONALD","PROCEDE"]
["GS","ISLAS MALVINAS","PROCEDE"]
["HM","ISLAS MARINAS DEL NORTE","PROCEDE"]
["FK","ISLAS MARSHALL","DEBIDA DILIGENCIA AMPLIADA"]
["MP","ISLAS PITCAIRN","DEBIDA DILIGENCIA AMPLIADA"]
["MH","ISLAS SALOMON","DEBIDA DILIGENCIA AMPLIADA"]
["PN","ISLAS TOKELAU","DEBIDA DILIGENCIA AMPLIADA"]
["SB","ISLAS TURCAS Y CAICOS","DEBIDA DILIGENCIA AMPLIADA"]
["TK","ISLAS ULTRAMARINAS DE LOS EEUU","PROCEDE"]
["TC","ISLAS VIRGENES BRITANICAS","DEBIDA DILIGENCIA AMPLIADA"]
["UM","ISLAS VIRGENES DE ESTADOS UNIDOS DE AMERICA","DEBIDA DILIGENCIA AMPLIADA"]
["VG","ISLAS WALLIS FUTUNA","PROCEDE"]
["VI","ISRAEL","PROCEDE"]
["WF","ITALIA","PROCEDE"]
["IL","JAMAICA","DEBIDA DILIGENCIA AMPLIADA"]
["IT","JAPON","PROCEDE"]
["JM","JERSEY","PROCEDE"]
["JP","JORDANIA","DEBIDA DILIGENCIA AMPLIADA"]
["JE","KAZAJSTAN","PROCEDE"]
["JO","KENIA","PROCEDE"]
["KZ","KIRGUISTÁN","PROCEDE"]
["KE","KIRIBATI","DEBIDA DILIGENCIA AMPLIADA"]
["XK","KOSOVO","PROCEDE"]
["KG","KUWAIT","DEBIDA DILIGENCIA AMPLIADA"]
[null,"LABUAN","DEBIDA DILIGENCIA AMPLIADA"]
["KI","LAOS","PROCEDE"]
["KW","LESOTO","PROCEDE"]
["LA","LETONIA","PROCEDE"]
["LS","LIBANO","PROCEDE"]
["LV","LIBERIA","DEBIDA DILIGENCIA AMPLIADA"]
["LB","LIBIA","PROCEDE"]
["LR","LIECHTENSTEIN","PROCEDE"]
["LY","LITUANIA","PROCEDE"]
["LI","LUXEMBURGO","PROCEDE"]
["LT","MACAO","DEBIDA DILIGENCIA AMPLIADA"]
["LU","MACEDONIA","PROCEDE"]
["MO","MADAGASCAR","PROCEDE"]
[null,"MADEIRA","DEBIDA DILIGENCIA AMPLIADA"]
["MK","MALASIA","PROCEDE"]
["MG","MALAWI","PROCEDE"]
["MY","MALDIVAS","DEBIDA DILIGENCIA AMPLIADA"]
["MW","MALI","DEBIDA DILIGENCIA AMPLIADA"]
["MV","MALTA","PROCEDE"]
["ML","MARRUECOS","DEBIDA DILIGENCIA AMPLIADA"]
["MT","MARTINICA","PROCEDE"]
["MA","MAURICIO","DEBIDA DILIGENCIA AMPLIADA"]
["MQ","MAURITANIA","PROCEDE"]
["MU","MAYOTTE","PROCEDE"]
["MR","MEXICO","PROCEDE"]
["YT","MICRONESIA ESTADOS FEDERADOS","PROCEDE"]
["MX","MOLDOVA","PROCEDE"]
["FM","MONACO","DEBIDA DILIGENCIA AMPLIADA"]
["MD","MONGOLIA","PROCEDE"]
["MC","MONTENEGRO","PROCEDE"]
["MN","MONTSERRAT","DEBIDA DILIGENCIA AMPLIADA"]
["ME","MOZAMBIQUE","DEBIDA DILIGENCIA AMPLIADA"]
["MM","MYANMAR","DEBIDA DILIGENCIA AMPLIADA"]
["MS","NAMIBIA","PROCEDE"]
["MZ","NAURU","DEBIDA DILIGENCIA AMPLIADA"]
["NA","NEPAL","PROCEDE"]
["NR","NICARAGUA","PROCEDE"]
["NP","NIGER","PROCEDE"]
["NI","NIGERIA","DEBIDA DILIGENCIA AMPLIADA"]
["NE","NIUE","DEBIDA DILIGENCIA AMPLIADA"]
["NU","NORUEGA","PROCEDE"]
["NF","NUEVA CALEDONIA","PROCEDE"]
["NO","NUEVA ZELANDIA","PROCEDE"]
["NC","OMAN","DEBIDA DILIGENCIA AMPLIADA"]
["NZ","PAISES BAJOS (HOLANDA)","PROCEDE"]
["OM","PAKISTAN","PROCEDE"]
["NL","PALAOS","PROCEDE"]
["PW","PALAU","DEBIDA DILIGENCIA AMPLIADA"]
["PK","PANAMA","DEBIDA DILIGENCIA AMPLIADA"]
["PW","PAPUA NUEVA GUINEA","PROCEDE"]
["PA","PARAGUAY","PROCEDE"]
["PG","PERU","PROCEDE"]
["PY","POLINESIA FRANCESA","DEBIDA DILIGENCIA AMPLIADA"]
["PE","POLONIA","PROCEDE"]
["PF","PORTUGAL","PROCEDE"]
["PL","PUERTO RICO","DEBIDA DILIGENCIA AMPLIADA"]
["PT","QATAR","PROCEDE"]
[null,"REINO DE SWAZILANDIA ","DEBIDA DILIGENCIA AMPLIADA"]
["PR","REINO UNIDO","PROCEDE"]
["QA","REPUBLICA CENTRO AFRICANA","PROCEDE"]
["GB","REPUBLICA CHECA","PROCEDE"]
{"$rows_left_out":62}